{"text_format":"1","workbook":"xlsx","n_sheets":14,"sheets":["Home","Sizing Info","Load","Length","Pressure","Pressure Losses","EquivLength","Labor&Material","Fittings","Prices","Heat Loss","Cost Compare","scratch","wsfuGPM"],"not_rendered":{"charts":0,"images":10,"macros":1,"external_links":0,"defined_names":47,"comments":8,"pivot_tables":0},"unopened":[],"bounds":{"document_bytes":16777216,"sheet_cells":100000,"rows_first":2000,"rows_last":500,"rows_between":2000,"halvings":0,"cell_chars":16384,"cell_head_chars":4096},"cells_cut":0,"cells_raw":0,"read":"whole","date_system":"1900"}

{"sheet":"Home","index":0,"n_rows":21,"n_cols":2,"rows_kept":21,"cut":false,"hidden":false,"merged":[]}
[]
[]
[]
[]
[]
[]
[]
[]
[null,"This calculator utilizes Visual Basic for Applications (VBA)"]
[null,"For functionality, click the \"Options...\" button and select \"Enable this content\""]
{"$rows_left_out":12}
{"sheet":"Sizing Info","index":1,"n_rows":41,"n_cols":5,"rows_kept":41,"cut":false,"hidden":false,"merged":[[10,14,11,15],[12,14,13,15]]}
[]
[null,"This section will aid in the process of sizing water distribution piping using the Viega SmartLoop recirculation system."]
[null,null,"To properly size any portion of a building's piping system, the entire building must be considered."]
[null,null,"For accurate results please read the instructions on each page carefully and fill in all requested information."]
[null,null,null,"The method used is adapted from the method described in appendix E of The 2009 International Plumbing Code (IPC)."]
[null,null,null,null,"This method should also satisfy Uniform Plumbing Code requirements, but verification from local code authorities is required."]
[null,null,null,"This method finds all the pressure losses in the piping system and ensures that adequate pressure remains at the most remote fitting."]
[]
[null,"The \"Load\" tab can accommodate up to three different floor configurations, but matching floors must be consecutive. "]
[null,1,"Enter a name in upper yellow cell for each \"Type of Floor\" that will be used, starting from the left."]
{"$rows_left_out":32}
{"sheet":"Load","index":2,"n_rows":43,"n_cols":22,"rows_kept":43,"cut":false,"hidden":false,"merged":[[12,19,12,21],[10,15,11,17],[10,19,11,21],[42,8,42,9],[10,11,11,13],[10,7,12,9],[4,11,4,13],[12,11,12,13],[13,4,13,6],[12,15,12,17],[9,1,9,9],[8,1,8,9],[12,1,12,3],[10,4,10,6],[10,1,11,1],[10,2,11,2],[10,3,11,3]]}
[]
["This Table can accommodate up to three different floor configurations, but matching floors must be consecutive. ",null,null,null,null,null,null,null,null,null,"For example, floors 1 and 2 of Type A, 3 - 10 of Type B, and 11 and 12 of Type C"]
[1,"Enter a name in uppermost yellow cell (E12:G12) for each \"Type of Floor\" that will be used, starting from the left.",null,null,null,null,null,null,null,null,"If all floors are the same, only enter one type of floor name. "]
[2,"Enter number of floors that will match each configuration in lowest yellow cells (E13:G13)."]
[3,"Enter number of fixtures found on ONE floor of each type used, in remaining yellow cells (E15:G41) of the table below.",null,null,null,null,null,null,null,null,null,"Riser Totals:",null,null,null,null,null,null,"Headings"]
[4,"Load totals per floor are displayed in blue (L43:V43) at the bottom of each type. Riser total is in blue (L8:N8) to the right",null,null,null,null,null,null,null,null,null,"Cold","Hot","Total",null,null,null,null,"User Input Cells"]
[null,"   * Total load only applies for section of piping between water main and hot/cold Tee, where hot and cold loads split.",null,null,null,null,null,null,null,null,"                                   ","(wsfu)","(wsfu)","(wsfu)"," ",null,null,null,"Calculated Values, Constants"]
[null,null,null,null,null,null,null,null,null,null,null,{"$f":"($E13*cold)+($F13*P43)+($G13*T43)","v":532.25},{"$f":"($E13*cold)+($F13*Q43)+($G13*U43)","v":122.75},{"$f":"($E13*cold)+($F13*R43)+($G13*V43)","v":553.84999999999991},null,null,null,null,"Important Calculated Values"]
[null,"Load Values Assigned to Fixtures"]
[null,"International Plumbing Code Table 103.3(2)"]
{"$rows_left_out":34}
{"sheet":"Length","index":3,"n_rows":28,"n_cols":12,"rows_kept":28,"cut":false,"hidden":false,"merged":[[18,10,18,12],[17,1,18,3],[17,4,18,4],[1,16,2,17],[3,16,4,17],[13,1,13,4],[14,8,14,9],[15,1,15,3],[16,1,16,3],[15,8,15,9],[26,1,27,3],[19,4,20,4],[26,4,27,4],[21,1,22,4],[23,1,23,3],[24,1,24,3],[25,1,25,3],[19,1,20,3]]}
[]
[1,"Enter floor to floor height (in cell E17) (between piping on each floor)"]
[2,"Enter height difference between water main and first floor (in cell E18)"]
[null,"   * Since water mains are usually buried less than one story below ground, the height difference between the water main"]
[null,"     and the first floor piping is usually different from floor to floor height. "]
[3,"Enter horizontal distance of piping between water main and the point where system splits into hot and cold (in cell E20)."]
[null,"   * This section of piping will carry the total load of the building. The pressure loss due to pipe friction in this section must be applied "]
[null,"     to both hot and cold sides of the piping system."]
[4,"For each type of floor, enter the horizontal distance between riser and most remote fitting on that type of floor (in cells E24:E26)."]
[null,"   * only the highest floor (lowest grey cell) is included in developed length calculations"]
{"$rows_left_out":19}
{"sheet":"Pressure","index":4,"n_rows":50,"n_cols":16,"rows_kept":50,"cut":false,"hidden":false,"merged":[[28,9,28,15],[27,8,27,15],[19,1,19,3],[12,1,12,4],[13,1,13,4],[26,8,26,15],[25,1,25,3],[26,1,26,3],[12,6,12,8],[14,1,14,3],[29,1,29,4],[33,4,34,4],[16,1,16,3],[24,1,24,3],[15,1,15,3],[23,1,23,3],[20,1,20,3],[21,1,21,3],[22,1,22,3],[18,1,18,3],[17,1,17,3],[45,1,45,3],[46,1,46,3],[42,1,43,3],[30,1,30,4],[42,4,43,4],[41,1,41,3],[44,1,44,3],[35,1,35,3],[31,1,32,3],[38,1,38,3],[39,1,39,3],[40,1,40,3],[33,1,34,3],[36,1,36,3],[37,1,37,3]]}
[]
[null,1,"Enter pressure values in yellow cells (E15 through E24) below. "]
[null,null,"   * The list to the right of the upper table tells where to find pressure values"]
[null,2,"Minimum Pressure at most remote fitting (E18) should be for the most remote HOT water fitting."]
[null,3,"To find \"Pressure loss from tap into main\" (E20), the size of the tap and the maximum flow rate are needed."]
[null,4,"The flow rate can be found as follows:"]
[null,null,1,"On \"Pressure Losses\" tab, complete steps 1 - 6"]
[null,null,2,"Return to this tab and \"Loss of Pressure Through Tap\" table should have a row and column highlighted."]
[null,null,3,"The column that is highlighted is the recommended tap size."]
[null,null,4,"The row that is highlighted represents the required flow of the building."]
{"$rows_left_out":41}
{"sheet":"Pressure Losses","index":5,"n_rows":46,"n_cols":26,"rows_kept":46,"cut":false,"hidden":false,"merged":[[41,2,43,2],[20,2,40,2],[15,5,17,5],[15,6,17,6],[15,2,15,3],[19,3,19,4],[18,3,18,4],[45,12,46,12],[45,13,46,13],[45,14,46,14],[15,9,17,9],[15,7,17,7],[15,8,17,8],[15,14,17,14],[15,12,17,12],[15,13,17,13],[15,11,17,11],[15,10,17,10]]}
[]
[null,1,"Ensure \"Load\" and \"Length\" tabs are filled out correctly.",null,null,null,null,null,null,null,null,null,null,null,null,null,null,"Headings"]
[null,null,"*","main to hot/cold Tee (Row 20) is a single section of pipe. It will change depending on flush type because it provides water to both hot and cold sections.",null,null,null,null,null,null,null,null,null,null,null,null,null,"User Input Cells"]
[null,2,"Click \"Fill Tables\" button. This will display vertical demand loads and vertical lengths in table below. (Click again if any \"Loads\" are changed)",null,null,null,null,null,null,null,null,null,null,null,null,null,null,"Calculated Values, Constants",null,null,null,null,0,0,0,"Flush Tanks"]
[null,3,"Under \"Cold section\", select whether the majority of the cold water system uses flush tanks or flush valves.",null,null,null,null,null,null,null,null,null,null,null,null,null,null,"Important Values",null,null,null,null,0.5,0.54500000000000004,0,"Flush Valves"]
[null,null,"*"," flush type is necessary to find pressure drop in first section (Row 20), which supplies hot and cold systems.",null,null,null,null,null,null,null,null,null,null,null,null,null,null,null,null,null,null,0.75,0.78500000000000003,0]
[null,5,"Choose a trial pipe size (Column I) for each line in table below that has a value in the \"Demand Load\" column.",null,null,null,null,null,null,null,null,null,null,null,null,null,null,null,null,null,null,null,1,1.0149999999999999,0.89477650840866396]
[null,6,"Return to \"Pressure\" tab and enter \"Pressure loss from tap into main\" value using Section Flow (G20) in blue near top of table.",null,null,null,null,null,null,null,null,null,null,null,null,null,"velocity:",null,null,null,null,null,1.25,1.2649999999999999,1.1619918244118586]
[null,7,"Adjust trial pipe size  (Column I) until velocities (Column Q) are less than 5 feet per second.",null,null,null,null,null,null,null,null,null,null,null,null,null,null,"< 5 ft/sec",null,null,null,null,1.5,1.5049999999999999,1.4195157625049464]
[null,8,"Enter equivalent length of the fittings found between main and most remote fitting for each section of piping (Column J).",null,null,null,null,null,null,null,null,null,null,null,null,null,null," > 5 ft/sec1 (hot)",null,null,null,null,2,1.9850000000000001,1.9209958354978283]
{"$rows_left_out":37}
{"sheet":"EquivLength","index":6,"n_rows":23,"n_cols":21,"rows_kept":23,"cut":false,"hidden":false,"merged":[[10,1,11,2],[12,1,12,2],[11,4,11,5],[15,1,15,2],[13,1,13,2],[14,1,14,2],[21,1,22,2],[18,1,18,2],[16,1,16,2],[20,1,20,2],[17,1,17,2],[19,1,19,2]]}
[]
[null,null,null,null,null,null,null,null,null,null,null,null,null,null,null,null,null,null,null,null,0.5]
[null,"This tab contains a stand alone calculator to find equivalent lengths of a combination of fittings.",null,null,null,null,null,null,null,null,null,null,null,null,null,null,null,null,null,null,0.75]
[null,"    *The calculator on this tab is not linked to any other portion of the program.",null,null,null,null,null,null,null,null,null,null,null,null,null,null,null,null,null,null,1]
[null,1,"Select pipe size in upper yellow cell (E10).",null,null,null,null,null,null,null,null,null,null,null,null,null,null,null,null,null,1.25]
[null,2,"Enter quantity of each type of fitting used in yellow cells (D13:D21).",null,null,null,null,null,null,null,null,null,null,null,null,null,null,null,null,null,1.5]
[null,3,"Column E shows the equivalent length of each type of fitting.",null,null,null,null,null,null,null,null,null,null,null,null,null,null,null,null,null,2]
[null,4,"Total equivalent length of fittings shown will display in blue at the bottom (F23).",null,null,null,null,null,null,null,null,null,null,null,null,null,null,null,null,null,2.5]
[null,null,null,null,null,null,null,null,null,null,null,null,null,null,null,null,null,null,null,null,3]
[null,null,null,"pipe size:",0.75,"in",null,null,null,null,null,null,null,null,null,null,null,null,null,null,3.5]
{"$rows_left_out":14}
{"sheet":"Labor&Material","index":7,"n_rows":53,"n_cols":14,"rows_kept":53,"cut":false,"hidden":false,"merged":[[4,1,4,2],[5,1,6,1],[5,3,5,5],[4,8,4,9],[5,10,5,12],[5,8,6,8],[4,10,4,12],[44,13,52,13],[18,1,19,1],[17,1,17,2],[18,3,18,5],[42,10,42,12],[42,8,43,8],[41,1,41,2],[42,3,42,5],[42,1,43,1],[30,3,30,5],[30,1,31,1],[18,8,19,8],[18,10,18,12],[29,8,29,9],[30,8,31,8],[29,1,29,2],[17,8,17,9],[41,8,41,9],[44,6,52,6],[41,10,41,12],[41,3,41,5],[0,1,0,5],[1,1,1,5],[20,6,28,6],[20,13,28,13],[32,6,40,6],[32,13,40,13],[30,10,30,12],[4,3,4,5],[17,3,17,5],[29,3,29,5],[17,10,17,12],[29,10,29,12],[3,1,3,5],[3,8,3,12],[7,6,16,6],[7,13,16,13]]}
[null,"Enter cost in applicable yellow cells. Enter Multiplier in top right of each table."]
[null,"For any blank cell, the default value will be used in cost comparison calculations"]
[null,"Multipliers affect everything in that table (even user defined values)."]
[null,"Material Costs",null,null,null,null,null,null,"Labor Costs"]
[null,"Tubing Cost",null,{"$f":"IF(SUM(E8:E13)=0,\"Default Viega Value\",\"Contractor Price Calculation\")","v":"Default Viega Value"},null,null,"Multiplier:",null,"Tubing Installation",null,{"$f":"IF(SUM(L8:L13)=0,\"Default Viega Value\",\"Contractor Price Calculation\")","v":"Default Viega Value"},null,null,"Multiplier:"]
[null,"Description","Tube ","Cost of Tubing",null,null,1,null,"Description","Tube ","Labor Costs",null,null,1]
[null,null,"Size","Default","User Defined","Calculation","Notes:",null,null,"Size","Default","User Defined","Calculation","Notes:"]
[null,"PEX","3/8\" PEX",{"$f":"Prices!K14","v":0.55059999999999998},null,{"$f":"IF(E8<>0,E8,D8)*$G$6","v":0.55059999999999998},null,null,"Installation Cost PEX","3/8\" PEX",{"$f":"Prices!L14","v":1.6},null,{"$f":"IF(L8<>0,L8,K8)*$N$6","v":1.6},"PHCC Labor Calculator III labor times for one tee and 10 linear feet of copper tube @ $40.00 labor rate used."]
[null,"Copper Tube","1/2\"",{"$f":"Prices!K5","v":1.37},null,{"$f":"IF(E9<>0,E9,D9)*$G$6","v":1.37},null,null,"Installation Cost Copper","1/2\"",{"$f":"Prices!L5","v":6.5279999999999996},null,{"$f":"IF(L9<>0,L9,K9)*$N$6","v":6.5279999999999996}]
[null,"Copper Tube","3/4\"",{"$f":"Prices!K6","v":2.23},null,{"$f":"IF(E10<>0,E10,D10)*$G$6","v":2.23},null,null,"Installation Cost Copper","3/4\"",{"$f":"Prices!L6","v":8.9759999999999991},null,8.9759999999999991]
{"$rows_left_out":44}
{"sheet":"Fittings","index":8,"n_rows":40,"n_cols":27,"rows_kept":40,"cut":false,"hidden":false,"merged":[[4,2,4,4],[4,6,4,7],[3,19,3,22],[3,23,3,26],[21,5,21,6],[4,16,4,18],[18,5,18,6],[19,5,19,6],[20,5,20,6],[4,10,4,12],[4,13,4,15],[29,5,29,6],[27,5,27,6],[24,5,24,6],[30,20,30,22],[22,5,22,6],[23,5,23,6],[25,5,25,6],[28,20,28,22],[29,20,29,22]]}
[]
[null,null,null,null,null,null,"This sheet shows a comparison of installation costs between a SmartLoop recirculation system and a parallel system."]
[null,null,null,null,null,null,"The table on the right uses tube sizes selected on \"Pressure Losses\" tab to find the correct size tee for each floor."]
[null,null,null,null,null,null,null,null,null,null,"H","I","D","E",null,"T","H","I","S","SmartLoop",null,null,null,"Parallel"]
[null,null,"SmartLoop",null,null,null,"Parallel",null,null,null,"VBA Output",null,null,"num to Text  w/o zeros",null,null,"Parallel Tees",null,null,"Size of","Stock Number","cost per","cost per","Size of","Stock Number","cost per","cost per"]
[null,null,"tube",null,"material",null,"tube","material",null,null,"run","run","branch","run","run","branch","run","run","branch","Tees",null,"each","fitting","Fitting",null,"each","fitting"]
[null,"num","size","parallel","cost","length","size","cost",null,null,1,{"$f":"'Pressure Losses'!I21","v":2},{"$f":"L7","v":2},{"$f":"VLOOKUP(K7,$B$9:$C$13,2,FALSE)","v":"1\""},{"$f":"IF(L7=0,\"1\"\"\",VLOOKUP(L7,$B$9:$C$13,2,FALSE))","v":"2\""},{"$f":"VLOOKUP(M7,$B$9:$C$13,2,FALSE)","v":"2\""},null,{"$f":"VLOOKUP(L7,$B$9:$D$13,IF(L7<=M7,2,3),FALSE)","v":"2\""},{"$f":"R7","v":"2\""},{"$f":"O7&\"x\"&N7&\"x\"&P7","v":"2\"x1\"x2\""},{"$f":"IFERROR(VLOOKUP(T7,Prices!$B$6:$F$85,2,FALSE),\"\")","v":"77477 / 78112"},{"$f":"VLOOKUP(T7,Prices!$B$6:$F$85,3,FALSE)","v":89.9},{"$f":"IF(ISNUMBER(V7)=TRUE,V7,0)","v":89.9},{"$f":"R7&\"x\"&S7","v":"2\"x2\""},{"$f":"VLOOKUP(X7,Prices!$B$93:$F$98,2,FALSE)","v":77342},{"$f":"VLOOKUP(X7,Prices!$B$93:$F$98,3,FALSE)","v":63.18},{"$f":"IF(ISNUMBER(Z7)=TRUE,Z7,0)","v":63.18}]
[null,"size","(inches)",null,"USD","(ft)","(inches)","USD",null,null,2,2,1.25,{"$f":"VLOOKUP(K8,$B$9:$C$13,2,FALSE)","v":"2\""},{"$f":"IF(L8=0,\"1\"\"\",VLOOKUP(L8,$B$9:$C$13,2,FALSE))","v":"2\""},{"$f":"VLOOKUP(M8,$B$9:$C$13,2,FALSE)","v":"1-1/4\""},{"$f":"VLOOKUP(K8,$B$9:$D$13,IF(K8<=M8,2,3),FALSE)","v":"1-1/2\""},{"$f":"VLOOKUP(L8,$B$9:$D$13,IF(L8<=M8,2,3),FALSE)","v":"1-1/2\""},{"$f":"P8","v":"1-1/4\""},{"$f":"IFERROR(N8&\"x\"&O8&\"x\"&P8,\"\")","v":"2\"x2\"x1-1/4\""},{"$f":"IFERROR(VLOOKUP(T8,Prices!$B$6:$F$85,2,FALSE),\"\")","v":77487},{"$f":"VLOOKUP(T8,Prices!$B$6:$F$85,3,FALSE)","v":83.59},83.59,{"$f":"IF(L8=0,(N8&\"x\"&S8&\"x\"&S8),(N8&\"x\"&R8&\"x\"&S8))","v":"2\"x1-1/2\"x1-1/4\""},{"$f":"IFERROR(VLOOKUP(X8,Prices!$B$6:$F$85,2,FALSE),\"\")","v":15508},{"$f":"VLOOKUP(X8,Prices!$B$6:$F$85,3,FALSE)","v":101.38},{"$f":"IF(ISNUMBER(Z8)=TRUE,Z8,0)","v":101.38}]
[null,0.75,"3/4\"","3/4\"",null,{"$f":"F17+1","v":135},{"$f":"D17","v":"3/4\""},{"$f":"F9*VLOOKUP(D9,'Labor&Material'!$C$8:$F$17,4,FALSE)","v":301.05},null,null,2,2,1,"2\"","2\"","1\"",{"$f":"VLOOKUP(K9,$B$9:$D$13,IF(K9<=M9,2,3),FALSE)","v":"1-1/2\""},{"$f":"VLOOKUP(L9,$B$9:$D$13,IF(L9<=M9,2,3),FALSE)","v":"1-1/2\""},"1\"","2\"x2\"x1\"",{"$f":"IFERROR(VLOOKUP(T9,Prices!$B$6:$F$85,2,FALSE),\"\")","v":94772},{"$f":"VLOOKUP(T9,Prices!$B$6:$F$85,3,FALSE)","v":83.59},83.59,{"$f":"IFERROR(IF(L9=0,(Q9&\"x\"&S9&\"x\"&S9),(Q9&\"x\"&R9&\"x\"&S9)),\"\")","v":"1-1/2\"x1-1/2\"x1\""},{"$f":"IFERROR(VLOOKUP(X9,Prices!$B$6:$F$85,2,FALSE),\"\")","v":77467},{"$f":"VLOOKUP(X9,Prices!$B$6:$F$85,3,FALSE)","v":50.56},50.56]
[null,1,"1\"","3/4\"",{"$f":"F10*VLOOKUP(C10,'Labor&Material'!$C$8:$F$17,4,FALSE)","v":0},{"$f":"SUMIF('Pressure Losses'!$I$21:$I$40,B10,'Pressure Losses'!$H$21:$H$40)","v":0},{"$f":"D10","v":"3/4\""},{"$f":"F10*VLOOKUP(D10,'Labor&Material'!$C$8:$F$17,4,FALSE)","v":0},null,null,2,2,1,"2\"","2\"","1\"","1-1/2\"","1-1/2\"","1\"","2\"x2\"x1\"",{"$f":"IFERROR(VLOOKUP(T10,Prices!$B$6:$F$85,2,FALSE),\"\")","v":94772},{"$f":"VLOOKUP(T10,Prices!$B$6:$F$85,3,FALSE)","v":83.59},83.59,{"$f":"IFERROR(IF(L10=0,(Q10&\"x\"&S10&\"x\"&S10),(Q10&\"x\"&R10&\"x\"&S10)),\"\")","v":"1-1/2\"x1-1/2\"x1\""},{"$f":"IFERROR(VLOOKUP(X10,Prices!$B$6:$F$85,2,FALSE),\"\")","v":77467},{"$f":"VLOOKUP(X10,Prices!$B$6:$F$85,3,FALSE)","v":50.56},50.56]
{"$rows_left_out":31}
{"sheet":"Prices","index":9,"n_rows":120,"n_cols":15,"rows_kept":120,"cut":false,"hidden":false,"merged":[[0,0,0,5],[1,0,1,1],[1,2,1,5],[2,11,2,13]]}
["Default Prices should be updated on this tab and no where else"]
["everything is looked up by size",null,"change dates above table when any table is updated",null,null,null,null,null,null,null,null,"Aug 2012 Price List"]
[null,null,null,null,null,"Aug 2012 Price List",null,null,null,null,"material","Labor"]
["Fitting Type","size","Stock code","List ea.","Bag Price","Bag qty.",null,null,null,"size","cost per ft","pipe install","insulation","hangers","$40 labor hour multiplied by times"]
["SmartLoop Kit","SmartLoop Kit",79000,93.62,93.62,1,null,null,"Copper Tube","1/2\"",1.37,6.5279999999999996,1.2,4," from PHCC Labor Calculator III"]
["Copper Tee, P x P x P,","3/4\"x3/4\"x3/4\"",77387,9.4700000000000006,94.7,10,null,null,null,"3/4\"",2.23,8.9759999999999991,1.2,4]
[null,"1\"x3/4\"x3/4\"",77422,25.9,129.5,5,null,null,null,"1\"",3.32,9.7919999999999998,1.6,3.3200000000000003]
[null,"1\"x1\"x3/4\"",77437,19.38,96.9,5,null,null,null,"1-1/4\"",4.6900000000000004,11.423999999999999,1.6,2.8560000000000003]
[null,"1\"x1\"x1\"",77412,43.49,217.45,5,null,null,null,"1-1/2\"",6.07,13.872,2,2.5]
[null,"1-1/4\"x1\"x3/4\"",94762,28.81,28.81,1,null,null,null,"2\"",9.4600000000000009,15.911999999999999,2,2.5]
{"$rows_left_out":111}
{"sheet":"Heat Loss","index":10,"n_rows":51,"n_cols":33,"rows_kept":51,"cut":false,"hidden":false,"merged":[[2,12,3,13],[4,12,5,13],[10,1,10,3],[12,1,12,3],[35,7,35,8],[32,7,32,8],[34,7,34,8],[13,1,13,3],[25,1,25,2],[24,1,24,4],[25,3,25,4],[11,1,11,3],[37,15,37,18],[15,9,16,9],[22,10,22,11],[31,7,31,8],[30,7,30,8],[34,15,36,18],[22,15,22,16],[36,7,36,8],[37,7,37,8],[23,15,23,16],[23,10,23,11],[27,10,27,11],[33,7,33,8]]}
[]
[1,"Select \"Calculate Minimum Flow\" or \"Calculate Riser Temperatures\" to begin.",null,null,null,null,null,null,null,null,null,null,null,null,null,null,null,1,0.75,null,null,null,null,null,null,null,null,0.1]
[2,"Enter heater and ambient temperatures in upper yellow cells (E11:E13).",null,null,null,null,null,null,null,null,null,null,null,null,null,null,null,1.25,1,null,null,null,null,null,null,null,null,0.2]
[3,"Enter insulation thermal resistance (k value) in yellow cell below (F19).",null,null,null,null,null,null,null,null,null,null,null,null,null,null,null,1.5,1.25,null,null,null,null,null,null,null,null,0.3]
[4,"Enter \"insulation thickness\" (in inches) in yellow cells in middle of second table (G19, G21, and G22).",null,null,null,null,null,null,null,null,null,null,null,null,null,null,null,2,1.5,null,null,null,null,null,null,null,null,0.4]
[5,"Enter minimum allowable system temperature in second yellow cell (E12).",null,null,null,null,null,null,null,null,null,null,null,null,null,null,null,2.5,2,null,null,null,null,null,null,null,null,0.5]
[6,"Click \" Calculate \" button, ",null,null,null,null,null,null,null,null,null,null,null,null,null,null,null,3,2.5,null,null,null,null,null,null,null,null,0.6]
[7,"Minimum flow rates required to maintain temperature above the minimum alowable temperature will be displayed in the blue cells (I19, I21).",null,null,null,null,null,null,null,null,null,null,null,null,null,null,null,4,3,null,null,null,null,null,null,null,null,0.7]
[8,"Calculating temperatures based on flow rate is now recommended as it will give more accurate results.",null,null,null,null,null,null,null,null,null,null,null,null,null,null,null,null,null,null,null,null,null,null,null,null,null,0.8]
[null,null,null,null,null,null,null,null,null,null,null,null,null,null,null,null,null,null,null,null,null,null,null,null,null,null,null,0.9]
{"$rows_left_out":42}
{"sheet":"Cost Compare","index":11,"n_rows":40,"n_cols":19,"rows_kept":40,"cut":false,"hidden":false,"merged":[[20,11,20,14],[18,1,18,2],[13,9,13,11],[13,15,13,17],[24,11,24,14],[24,1,24,2],[21,11,21,14],[23,11,23,14],[27,11,27,14],[25,11,25,14],[29,11,29,14],[23,9,23,10],[27,9,27,10],[28,11,28,14]]}
[]
[1,"Enter local price of electricity, natural gas, and water in top 3 yellow cells (C15:C17). (initial values are national averages for first six months of 2012)"]
[2,"Enter total time (in hours per day) that circulation system will be operated in yellow cell under circulation operation (F15)."]
[3,"Enter the power rating of the circulator and efficiency of the water heater (C20:C21)"]
[null,"      * With No Recirculation, this sheet uses the estimate that stagnant water in pipe will cool to ambient every 2 operating hours"]
[null,"Notes:","Calculations on this sheet are based on differences in only the design of the hot water risers. "]
[null,null,"Gas fired hot water heaters are used in this comparison."]
[null,null,"All other parts of the water distribution system are assumed to be equal and do not affect any calculations on this page."]
[null,null,"Total water usage depends on installed fixtures, flow rates, and frequency of use (the numbers shown represent water usage strictly due to recirculating or waiting for hot water)."]
[null,null,"\"No Recirculation\" calculations are based on heating and replacing the water that will sit and cool in the riser every 2 hours."]
{"$rows_left_out":31}
{"sheet":"scratch","index":12,"n_rows":0,"n_cols":0,"rows_kept":0,"cut":false,"hidden":true,"merged":[]}

{"sheet":"wsfuGPM","index":13,"n_rows":58,"n_cols":18,"rows_kept":58,"cut":false,"hidden":true,"merged":[[2,3,2,4],[5,5,8,7],[13,6,13,7],[14,6,14,7],[19,6,19,7],[21,6,21,7],[15,6,15,7],[16,6,16,7],[17,6,17,7],[18,6,18,7],[20,6,20,7]]}
[]
[]
[null,null,null,"demand"]
[null,null,"Load","tank","valve"]
[null,null,null,"(GPM)","(GPM)"]
[null,null,1,3,3,"note: zero fixtures allows the program to stop at one fixture unit. An input of zero is interpreted the same as blank."]
[null,null,{"$f":"C6+1","v":2},3,3]
[null,null,{"$f":"C7+1","v":3},5,5]
[null,null,4,6.5,6.5]
[null,null,5,8,8]
{"$rows_left_out":48}